crossplatform.ru

Здравствуйте, гость ( Вход | Регистрация )


  Ответ в :: error: [debug/main.o] Error -1073741819
Введите ваше имя
Подтвердите код

Введите в поле код из 6 символов, отображенных в виде изображения. Если вы не можете прочитать код с изображения, нажмите на изображение для генерации нового кода.
 

Опции сообщения
 Включить смайлы?
Иконки сообщения
(Опционально)
                                
                                
  [ Без иконки ]
 


Последние 10 сообщений [ в обратном порядке ]
silver47 Дата 3.6.2011, 12:22
 
Цитата(epishev @ 3.6.2011, 15:21) *
Есть где-нибудь список таких ошибок с описанием?


Не встречал.
epishev Дата 3.6.2011, 12:21
 
Цитата(silver47 @ 3.6.2011, 13:07) *
если код не представляет из себя коммерческой тайны, то выкладывайте сюда. Попробуем собрать и разобраться.

UPD. В догонку, понимаю что вопрос глупый, но хоть чего-нибудь Вы собирали на этой системе? Примеры собираются \ запускаются, а пустой проект?



да, собирал....

код... будете смеяться...

ошибка вылетает даже когда оставил только

#include <QApplication>

int main(int argc,char *argv[])
{
QApplication app(argc,argv);

return app.exec();
}

никогда не было таких ошибок... А сегодня сел написал 2 ф-ции - не компилится...

Есть где-нибудь список таких ошибок с описанием?

silver47 Дата 3.6.2011, 12:07
  если код не представляет из себя коммерческой тайны, то выкладывайте сюда. Попробуем собрать и разобраться.

UPD. В догонку, понимаю что вопрос глупый, но хоть чего-нибудь Вы собирали на этой системе? Примеры собираются \ запускаются, а пустой проект?
epishev Дата 3.6.2011, 11:55
 
Цитата(silver47 @ 3.6.2011, 12:49) *
Он хоть раз собирался?

нет
silver47 Дата 3.6.2011, 11:49
  Ничего не могу посоветовать, кроме как выполнить очистку проекта и собрать снова. Он хоть раз собирался?
epishev Дата 3.6.2011, 11:28
 
Цитата(silver47 @ 3.6.2011, 12:13) *
Покажите сообщения компилятора Alt+4.



Выполняется сборка проекта file...
Настройки не изменились, этап qmake пропускается.
Запускается "C:/Qt/2010.05/mingw/bin/mingw32-make.exe" -w
mingw32-make: Entering directory `D:/Job/file-build-desktop'

C:/Qt/2010.05/mingw/bin/mingw32-make -f Makefile.Debug

mingw32-make[1]: Entering directory `D:/Job/file-build-desktop'

g++ -c -g -frtti -fexceptions -mthreads -Wall -DUNICODE -DQT_LARGEFILE_SUPPORT -DQT_DLL -DQT_GUI_LIB -DQT_CORE_LIB -DQT_THREAD_SUPPORT -DQT_NEEDS_QMAIN -I"c:\Qt\2010.05\qt\include\QtCore" -I"c:\Qt\2010.05\qt\include\QtGui" -I"c:\Qt\2010.05\qt\include" -I"c:\Qt\2010.05\qt\include\ActiveQt" -I"debug" -I"..\file" -I"." -I"c:\Qt\2010.05\qt\mkspecs\win32-g++" -o debug\main.o ..\file\main.cpp

mingw32-make[1]: Leaving directory `D:/Job/file-build-desktop'

mingw32-make: Leaving directory `D:/Job/file-build-desktop'

mingw32-make[1]: *** [debug/main.o] Error -1073741819

mingw32-make: *** [debug] Error 2

Процесс "C:/Qt/2010.05/mingw/bin/mingw32-make.exe" завершился с кодом %2.
Возникла ошибка при сборке проекта file (цель: Настольный компьютер)
Во время выполнения сборки на этапе "Сборка"
silver47 Дата 3.6.2011, 11:13
  Покажите сообщения компилятора Alt+4.
epishev Дата 3.6.2011, 11:07
  Всем привет!

Что это за ошибка?


:: error: [debug/main.o] Error -1073741819

Заранее спасибо!
Просмотр темы полностью (откроется в новом окне)
RSS Текстовая версия Сейчас: 9.12.2021, 7:43