crossplatform.ru

Здравствуйте, гость ( Вход | Регистрация )

 
Ответить в данную темуНачать новую тему
> :: error: [debug/main.o] Error -1073741819
epishev
  опции профиля:
сообщение 3.6.2011, 11:07
Сообщение #1


Студент
*

Группа: Участник
Сообщений: 89
Регистрация: 23.3.2011
Пользователь №: 2533

Спасибо сказали: 0 раз(а)




Репутация:   0  


Всем привет!

Что это за ошибка?


:: error: [debug/main.o] Error -1073741819

Заранее спасибо!
Перейти в начало страницы
 
Быстрая цитата+Цитировать сообщение
silver47
  опции профиля:
сообщение 3.6.2011, 11:13
Сообщение #2


Активный участник
***

Группа: Участник
Сообщений: 356
Регистрация: 1.4.2010
Пользователь №: 1584

Спасибо сказали: 40 раз(а)




Репутация:   6  


Покажите сообщения компилятора Alt+4.
Перейти в начало страницы
 
Быстрая цитата+Цитировать сообщение
epishev
  опции профиля:
сообщение 3.6.2011, 11:28
Сообщение #3


Студент
*

Группа: Участник
Сообщений: 89
Регистрация: 23.3.2011
Пользователь №: 2533

Спасибо сказали: 0 раз(а)




Репутация:   0  


Цитата(silver47 @ 3.6.2011, 12:13) *
Покажите сообщения компилятора Alt+4.



Выполняется сборка проекта file...
Настройки не изменились, этап qmake пропускается.
Запускается "C:/Qt/2010.05/mingw/bin/mingw32-make.exe" -w
mingw32-make: Entering directory `D:/Job/file-build-desktop'

C:/Qt/2010.05/mingw/bin/mingw32-make -f Makefile.Debug

mingw32-make[1]: Entering directory `D:/Job/file-build-desktop'

g++ -c -g -frtti -fexceptions -mthreads -Wall -DUNICODE -DQT_LARGEFILE_SUPPORT -DQT_DLL -DQT_GUI_LIB -DQT_CORE_LIB -DQT_THREAD_SUPPORT -DQT_NEEDS_QMAIN -I"c:\Qt\2010.05\qt\include\QtCore" -I"c:\Qt\2010.05\qt\include\QtGui" -I"c:\Qt\2010.05\qt\include" -I"c:\Qt\2010.05\qt\include\ActiveQt" -I"debug" -I"..\file" -I"." -I"c:\Qt\2010.05\qt\mkspecs\win32-g++" -o debug\main.o ..\file\main.cpp

mingw32-make[1]: Leaving directory `D:/Job/file-build-desktop'

mingw32-make: Leaving directory `D:/Job/file-build-desktop'

mingw32-make[1]: *** [debug/main.o] Error -1073741819

mingw32-make: *** [debug] Error 2

Процесс "C:/Qt/2010.05/mingw/bin/mingw32-make.exe" завершился с кодом %2.
Возникла ошибка при сборке проекта file (цель: Настольный компьютер)
Во время выполнения сборки на этапе "Сборка"
Перейти в начало страницы
 
Быстрая цитата+Цитировать сообщение
silver47
  опции профиля:
сообщение 3.6.2011, 11:49
Сообщение #4


Активный участник
***

Группа: Участник
Сообщений: 356
Регистрация: 1.4.2010
Пользователь №: 1584

Спасибо сказали: 40 раз(а)




Репутация:   6  


Ничего не могу посоветовать, кроме как выполнить очистку проекта и собрать снова. Он хоть раз собирался?
Перейти в начало страницы
 
Быстрая цитата+Цитировать сообщение
epishev
  опции профиля:
сообщение 3.6.2011, 11:55
Сообщение #5


Студент
*

Группа: Участник
Сообщений: 89
Регистрация: 23.3.2011
Пользователь №: 2533

Спасибо сказали: 0 раз(а)




Репутация:   0  


Цитата(silver47 @ 3.6.2011, 12:49) *
Он хоть раз собирался?

нет
Перейти в начало страницы
 
Быстрая цитата+Цитировать сообщение
silver47
  опции профиля:
сообщение 3.6.2011, 12:07
Сообщение #6


Активный участник
***

Группа: Участник
Сообщений: 356
Регистрация: 1.4.2010
Пользователь №: 1584

Спасибо сказали: 40 раз(а)




Репутация:   6  


если код не представляет из себя коммерческой тайны, то выкладывайте сюда. Попробуем собрать и разобраться.

UPD. В догонку, понимаю что вопрос глупый, но хоть чего-нибудь Вы собирали на этой системе? Примеры собираются \ запускаются, а пустой проект?

Сообщение отредактировал silver47 - 3.6.2011, 12:10
Перейти в начало страницы
 
Быстрая цитата+Цитировать сообщение
epishev
  опции профиля:
сообщение 3.6.2011, 12:21
Сообщение #7


Студент
*

Группа: Участник
Сообщений: 89
Регистрация: 23.3.2011
Пользователь №: 2533

Спасибо сказали: 0 раз(а)




Репутация:   0  


Цитата(silver47 @ 3.6.2011, 13:07) *
если код не представляет из себя коммерческой тайны, то выкладывайте сюда. Попробуем собрать и разобраться.

UPD. В догонку, понимаю что вопрос глупый, но хоть чего-нибудь Вы собирали на этой системе? Примеры собираются \ запускаются, а пустой проект?



да, собирал....

код... будете смеяться...

ошибка вылетает даже когда оставил только

#include <QApplication>

int main(int argc,char *argv[])
{
QApplication app(argc,argv);

return app.exec();
}

никогда не было таких ошибок... А сегодня сел написал 2 ф-ции - не компилится...

Есть где-нибудь список таких ошибок с описанием?

Перейти в начало страницы
 
Быстрая цитата+Цитировать сообщение
silver47
  опции профиля:
сообщение 3.6.2011, 12:22
Сообщение #8


Активный участник
***

Группа: Участник
Сообщений: 356
Регистрация: 1.4.2010
Пользователь №: 1584

Спасибо сказали: 40 раз(а)




Репутация:   6  


Цитата(epishev @ 3.6.2011, 15:21) *
Есть где-нибудь список таких ошибок с описанием?


Не встречал.
Перейти в начало страницы
 
Быстрая цитата+Цитировать сообщение

Быстрый ответОтветить в данную темуНачать новую тему
Теги
Нет тегов для показа


1 чел. читают эту тему (гостей: 1, скрытых пользователей: 0)
Пользователей: 0




RSS Текстовая версия Сейчас: 9.12.2021, 7:00